Full log
Start 240: interface.ClientApiServiceTest.StreamConsumerFailureCancelsActiveInference
240/450 Test #240: interface.ClientApiServiceTest.StreamConsumerFailureCancelsActiveInference ........................... Passed 0.50 sec
Start 241: interface.ClientApiServiceTest.StreamConsumerExceptionCancelsBeforeInference
241/450 Test #241: interface.ClientApiServiceTest.StreamConsumerExceptionCancelsBeforeInference ......................... Passed 0.50 sec
Start 242: interface.ClientApiServiceTest.StreamSessionCreationFailureCleansTask
242/450 Test #242: interface.ClientApiServiceTest.StreamSessionCreationFailureCleansTask ................................ Passed 0.50 sec
Start 243: interface.MessagesFormatTest.ParseExtraBodyLoraIdAcceptsStringOrMissingValue
243/450 Test #243: interface.MessagesFormatTest.ParseExtraBodyLoraIdAcceptsStringOrMissingValue ......................... Passed 0.01 sec
Start 244: interface.MessagesFormatTest.ParseExtraBodyLoraIdRejectsInvalidValues
244/450 Test #244: interface.MessagesFormatTest.ParseExtraBodyLoraIdRejectsInvalidValues ................................ Passed 0.50 sec
Start 245: interface.MessagesFormatTest.ParseExtraBodyLoraIdRejectsLegacyEnableLora
245/450 Test #245: interface.MessagesFormatTest.ParseExtraBodyLoraIdRejectsLegacyEnableLora ............................. Passed 0.01 sec
Start 246: interface.MessagesFormatTest.ValidateMessagesMustBeNonEmptyArray
246/450 Test #246: interface.MessagesFormatTest.ValidateMessagesMustBeNonEmptyArray ..................................... Passed 0.01 sec
Start 247: interface.MessagesFormatTest.ValidateMalformedMessageFieldsRejected
247/450 Test #247: interface.MessagesFormatTest.ValidateMalformedMessageFieldsRejected .................................. Passed 0.01 sec
Start 248: interface.MessagesFormatTest.ValidateEmptyUserContentRejected
248/450 Test #248: interface.MessagesFormatTest.ValidateEmptyUserContentRejected ........................................ Passed 0.01 sec
Start 249: interface.MessagesFormatTest.ValidateContentMustBeStringOrArray
249/450 Test #249: interface.MessagesFormatTest.ValidateContentMustBeStringOrArray ...................................... Passed 0.01 sec
Start 250: interface.MessagesFormatTest.ValidateAssistantFirstRejected
250/450 Test #250: interface.MessagesFormatTest.ValidateAssistantFirstRejected .......................................... Passed 0.01 sec
Start 251: interface.MessagesFormatTest.ValidateRelaxedRoleOrderingAccepted
251/450 Test #251: interface.MessagesFormatTest.ValidateRelaxedRoleOrderingAccepted ..................................... Passed 0.01 sec
Start 252: interface.MessagesFormatTest.ValidateSystemPlacementRulesRejected
252/450 Test #252: interface.MessagesFormatTest.ValidateSystemPlacementRulesRejected .................................... Passed 0.01 sec
Start 253: interface.MessagesFormatTest.ValidateReasoningContentOnlyOnAssistant
253/450 Test #253: interface.MessagesFormatTest.ValidateReasoningContentOnlyOnAssistant ................................. Passed 0.01 sec
Start 254: interface.MessagesFormatTest.ValidateAssistantEmptyContentWithReasoningAccepted
254/450 Test #254: interface.MessagesFormatTest.ValidateAssistantEmptyContentWithReasoningAccepted ...................... Passed 0.01 sec
Start 255: interface.MessagesFormatTest.ValidateReasoningContentMustBeString
255/450 Test #255: interface.MessagesFormatTest.ValidateReasoningContentMustBeString .................................... Passed 0.01 sec
Start 256: interface.MessagesFormatTest.ValidateReasoningContentWhitespaceOnlyTreatedAsEmpty
256/450 Test #256: interface.MessagesFormatTest.ValidateReasoningContentWhitespaceOnlyTreatedAsEmpty .................... Passed 0.01 sec
Start 257: interface.MessagesFormatTest.ValidateAssistantStringContentRejectsBlankWithoutFallback
257/450 Test #257: interface.MessagesFormatTest.ValidateAssistantStringContentRejectsBlankWithoutFallback ............... Passed 0.01 sec
Start 258: interface.MessagesFormatTest.ValidateAssistantNullOrMissingContentRequiresToolCalls
258/450 Test #258: interface.MessagesFormatTest.ValidateAssistantNullOrMissingContentRequiresToolCalls .................. Passed 0.01 sec
Start 259: interface.MessagesFormatTest.ValidateAssistantContentArrayRules
259/450 Test #259: interface.MessagesFormatTest.ValidateAssistantContentArrayRules ...................................... Passed 0.01 sec
Start 260: interface.MessagesFormatTest.ValidateToolCallsOnlyOnAssistantAndNonEmpty
260/450 Test #260: interface.MessagesFormatTest.ValidateToolCallsOnlyOnAssistantAndNonEmpty ............................. Passed 0.01 sec
Start 261: interface.MessagesFormatTest.ValidateAssistantEmptyContentPrioritizesValidToolCalls
261/450 Test #261: interface.MessagesFormatTest.ValidateAssistantEmptyContentPrioritizesValidToolCalls .................. Passed 0.01 sec
Start 262: interface.MessagesFormatTest.ValidateAssistantContentWithToolCallsAccepted
262/450 Test #262: interface.MessagesFormatTest.ValidateAssistantContentWithToolCallsAccepted ........................... Passed 0.01 sec
Start 263: interface.MessagesFormatTest.ValidateMalformedToolCallEntriesRejected
263/450 Test #263: interface.MessagesFormatTest.ValidateMalformedToolCallEntriesRejected ................................ Passed 0.01 sec
Start 264: interface.MessagesFormatTest.ValidateToolMessageCallIdMustBeNonEmpty
264/450 Test #264: interface.MessagesFormatTest.ValidateToolMessageCallIdMustBeNonEmpty ................................. Passed 0.01 sec
Start 265: interface.MessagesFormatTest.ValidateToolMessageContentMustBeNonBlank
265/450 Test #265: interface.MessagesFormatTest.ValidateToolMessageContentMustBeNonBlank ................................ Passed 0.01 sec
Start 266: interface.MessagesFormatTest.ValidateToolResponseFlowRejected
266/450 Test #266: interface.MessagesFormatTest.ValidateToolResponseFlowRejected ........................................ Passed 0.01 sec
Start 267: interface.MessagesFormatTest.ValidateImageOnlyContentAccepted
267/450 Test #267: interface.MessagesFormatTest.ValidateImageOnlyContentAccepted ........................................ Passed 0.01 sec
Start 268: interface.MessagesFormatTest.ValidateUnsupportedImageUrlsRejected
268/450 Test #268: interface.MessagesFormatTest.ValidateUnsupportedImageUrlsRejected .................................... Passed 0.01 sec
Start 269: interface.MessagesFormatTest.ValidateImageUrlWithoutUrlFieldRejected
269/450 Test #269: interface.MessagesFormatTest.ValidateImageUrlWithoutUrlFieldRejected ................................. Passed 0.01 sec
Start 270: interface.MessagesFormatTest.ValidateImageUrlFieldNotObjectRejected
270/450 Test #270: interface.MessagesFormatTest.ValidateImageUrlFieldNotObjectRejected .................................. Passed 0.01 sec
Start 271: interface.MessagesFormatTest.ValidateUnsupportedContentTypeRejected
271/450 Test #271: interface.MessagesFormatTest.ValidateUnsupportedContentTypeRejected .................................. Passed 0.01 sec
Start 272: interface.MessagesFormatTest.ValidateContentPartRequiredFieldsAndTypesRejected
272/450 Test #272: interface.MessagesFormatTest.ValidateContentPartRequiredFieldsAndTypesRejected ....................... Passed 0.01 sec
Start 273: interface.MessagesFormatTest.ValidateContentArrayNonObjectElementRejected
273/450 Test #273: interface.MessagesFormatTest.ValidateContentArrayNonObjectElementRejected ............................ Passed 0.01 sec
Start 274: interface.MessagesFormatTest.ValidateContentArrayOnlyEmptyTextRejected
274/450 Test #274: interface.MessagesFormatTest.ValidateContentArrayOnlyEmptyTextRejected ............................... Passed 0.01 sec
Start 275: interface.MessagesFormatTest.ValidateContentArrayEmptyTextWithImageAccepted
275/450 Test #275: interface.MessagesFormatTest.ValidateContentArrayEmptyTextWithImageAccepted .......................... Passed 0.01 sec
Start 276: interface.MessagesFormatTest.FormatThreeRoundsPlainText
276/450 Test #276: interface.MessagesFormatTest.FormatThreeRoundsPlainText .............................................. Passed 0.01 sec
Start 277: interface.MessagesFormatTest.FormatSystemMessageChatMLStructure
277/450 Test #277: interface.MessagesFormatTest.FormatSystemMessageChatMLStructure ...................................... Passed 0.01 sec
Start 278: interface.MessagesFormatTest.FormatContentWithSpecialCharacters
278/450 Test #278: interface.MessagesFormatTest.FormatContentWithSpecialCharacters ...................................... Passed 0.01 sec
Start 279: interface.MessagesFormatTest.FormatRejectsInvalidMessagesDirectly
279/450 Test #279: interface.MessagesFormatTest.FormatRejectsInvalidMessagesDirectly .................................... Passed 0.50 sec
Start 280: interface.MessagesFormatTest.FormatRejectsInvalidToolHistoryBeforePreprocessing
280/450 Test #280: interface.MessagesFormatTest.FormatRejectsInvalidToolHistoryBeforePreprocessing ...................... Passed 0.50 sec
Start 281: interface.MessagesFormatTest.FormatPromptOnlyToolHistoryWithoutCurrentTools
281/450 Test #281: interface.MessagesFormatTest.FormatPromptOnlyToolHistoryWithoutCurrentTools .......................... Passed 0.01 sec
Start 282: interface.MessagesFormatTest.FormatPromptOnlyToolCallsSeparatedByLineBreak
282/450 Test #282: interface.MessagesFormatTest.FormatPromptOnlyToolCallsSeparatedByLineBreak ........................... Passed 0.01 sec
Start 283: interface.MessagesFormatTest.FormatPromptOnlyParallelToolResponsesFollowToolCallOrder
283/450 Test #283: interface.MessagesFormatTest.FormatPromptOnlyParallelToolResponsesFollowToolCallOrder ................ Passed 0.01 sec
Start 284: interface.MessagesFormatTest.FormatPromptOnlyDoesNotMergeAdjacentAssistantMessages
284/450 Test #284: interface.MessagesFormatTest.FormatPromptOnlyDoesNotMergeAdjacentAssistantMessages ................... Passed 0.01 sec
Start 285: interface.MessagesFormatTest.FormatPromptOnlyToolCallInvalidArgumentsFallbackToEmptyObject
285/450 Test #285: interface.MessagesFormatTest.FormatPromptOnlyToolCallInvalidArgumentsFallbackToEmptyObject ........... Passed 0.50 sec
Start 286: interface.MessagesFormatTest.FormatMultiTurnTwoImagesOrderMatchesPlaceholders
286/450 Test #286: interface.MessagesFormatTest.FormatMultiTurnTwoImagesOrderMatchesPlaceholders ........................ Passed 0.01 sec
Start 287: interface.MessagesFormatTest.FormatMixedTextAndMultipleImagesInSingleTurn
287/450 Test #287: interface.MessagesFormatTest.FormatMixedTextAndMultipleImagesInSingleTurn ............................ Passed 0.01 sec
Start 288: interface.MessagesFormatTest.FormatValidBase64ImagePopulatesBuffers
288/450 Test #288: interface.MessagesFormatTest.FormatValidBase64ImagePopulatesBuffers .................................. Passed 0.01 sec
Start 289: interface.MessagesFormatTest.FormatInvalidBase64DataUrlRejected
289/450 Test #289: interface.MessagesFormatTest.FormatInvalidBase64DataUrlRejected ...................................... Passed 0.50 sec
Start 290: interface.MessagesFormatTest.FormatAssistantReasoningContentInjectedToChatML
290/450 Test #290: interface.MessagesFormatTest.FormatAssistantReasoningContentInjectedToChatML ......................... Passed 0.01 sec
Start 291: interface.MessagesFormatTest.FormatAssistantReasoningOnlyNoContent
291/450 Test #291: interface.MessagesFormatTest.FormatAssistantReasoningOnlyNoContent ................................... Passed 0.01 sec
Start 292: interface.MessagesFormatTest.FormatAssistantToolCallsPreserveReasoningContent
292/450 Test #292: interface.MessagesFormatTest.FormatAssistantToolCallsPreserveReasoningContent ........................ Passed 0.01 sec
Start 293: interface.MessagesFormatTest.FormatQwenThinkingStylesDisabledAppendEmptyBlock
293/450 Test #293: interface.MessagesFormatTest.FormatQwenThinkingStylesDisabledAppendEmptyBlock ........................ Passed 0.01 sec
Start 294: interface.MessagesFormatTest.FormatQwen3BaseThinkingEnabledNoOpenTag
294/450 Test #294: interface.MessagesFormatTest.FormatQwen3BaseThinkingEnabledNoOpenTag ................................. Passed 0.01 sec
Start 295: interface.MessagesFormatTest.FormatQwen35ThinkingEnabledAppendsOpenTag
295/450 Test #295: interface.MessagesFormatTest.FormatQwen35ThinkingEnabledAppendsOpenTag ............................... Passed 0.01 sec
Start 296: interface.MessagesFormatTest.FormatNonQwen3ModelNoThinkingSuffix
296/450 Test #296: interface.MessagesFormatTest.FormatNonQwen3ModelNoThinkingSuffix ..................................... Passed 0.01 sec
Start 297: interface.MessagesFormatTest.FormatQwenEndsWithAssistantNoThinkingSuffix
297/450 Test #297: interface.MessagesFormatTest.FormatQwenEndsWithAssistantNoThinkingSuffix ............................. Passed 0.01 sec
Start 298: interface.MessagesFormatTest.FormatQwenEndsWithAssistantReasoningDoesNotAppendGenerationSuffix
298/450 Test #298: interface.MessagesFormatTest.FormatQwenEndsWithAssistantReasoningDoesNotAppendGenerationSuffix ....... Passed 0.01 sec
Start 299: interface.MessagesFormatTest.ParseThinkingDefaultWhenOmitted
299/450 Test #299: interface.MessagesFormatTest.ParseThinkingDefaultWhenOmitted ......................................... Passed 0.01 sec
Start 300: interface.MessagesFormatTest.ParseThinkingSingleSourceValues
300/450 Test #300: interface.MessagesFormatTest.ParseThinkingSingleSourceValues ......................................... Passed 0.01 sec
Start 301: interface.MessagesFormatTest.ParseThinkingConsistentMultipleSources
301/450 Test #301: interface.MessagesFormatTest.ParseThinkingConsistentMultipleSources .................................. Passed 0.01 sec
Start 302: interface.MessagesFormatTest.ParseThinkingNonBooleanRejected
302/450 Test #302: interface.MessagesFormatTest.ParseThinkingNonBooleanRejected ......................................... Passed 0.01 sec
Start 303: interface.MessagesFormatTest.ParseThinkingTypeMissingOrNotStringRejected
303/450 Test #303: interface.MessagesFormatTest.ParseThinkingTypeMissingOrNotStringRejected ............................. Passed 0.01 sec
Start 304: interface.MessagesFormatTest.ParseThinkingConflictRejected
304/450 Test #304: interface.MessagesFormatTest.ParseThinkingConflictRejected ........................................... Passed 0.01 sec
Start 305: interface.MessagesFormatTest.ParseReasoningFormatDefaultsToAuto
305/450 Test #305: interface.MessagesFormatTest.ParseReasoningFormatDefaultsToAuto ...................................... Passed 0.01 sec
Start 306: interface.MessagesFormatTest.ParseReasoningFormatExplicitModes
306/450 Test #306: interface.MessagesFormatTest.ParseReasoningFormatExplicitModes ....................................... Passed 0.01 sec
Start 307: interface.MessagesFormatTest.ParseReasoningFormatInvalidValuesRejected
307/450 Test #307: interface.MessagesFormatTest.ParseReasoningFormatInvalidValuesRejected ............................... Passed 0.01 sec
Start 308: interface.MessagesFormatTest.ResolveSupportedThinkingStylesFromModelsJson
308/450 Test #308: interface.MessagesFormatTest.ResolveSupportedThinkingStylesFromModelsJson ............................ Passed 0.01 sec
Start 309: interface.MessagesFormatTest.ResolveThinkingStyleQwen3DotXFromJson
309/450 Test #309: interface.MessagesFormatTest.ResolveThinkingStyleQwen3DotXFromJson ................................... Passed 0.01 sec
Start 310: interface.MessagesFormatTest.ResolveThinkingStyleUnregisteredModelReturnsNone
310/450 Test #310: interface.MessagesFormatTest.ResolveThinkingStyleUnregisteredModelReturnsNone ........................ Passed 0.01 sec
Start 311: interface.MessagesFormatTest.ResolveThinkingStyleReturnsNoneForBadConfig
311/450 Test #311: interface.MessagesFormatTest.ResolveThinkingStyleReturnsNoneForBadConfig ............................. Passed 0.01 sec
Start 312: interface.ToolCallRequestTest.ToolsMustBeArray
312/450 Test #312: interface.ToolCallRequestTest.ToolsMustBeArray ....................................................... Passed 0.01 sec
Start 313: interface.ToolCallRequestTest.MalformedToolDefinitionsRejected
313/450 Test #313: interface.ToolCallRequestTest.MalformedToolDefinitionsRejected ....................................... Passed 0.01 sec
Start 314: interface.ToolCallRequestTest.ToolFunctionNamePatternRejected
314/450 Test #314: interface.ToolCallRequestTest.ToolFunctionNamePatternRejected ........................................ Passed 0.01 sec
Start 315: interface.ToolCallRequestTest.DuplicateToolFunctionNameRejected
315/450 Test #315: interface.ToolCallRequestTest.DuplicateToolFunctionNameRejected ...................................... Passed 0.01 sec
Start 316: interface.ToolCallRequestTest.ToolFunctionDescriptionTypeRejected
316/450 Test #316: interface.ToolCallRequestTest.ToolFunctionDescriptionTypeRejected .................................... Passed 0.01 sec
Start 317: interface.ToolCallRequestTest.ToolFunctionParametersTypeRejected
317/450 Test #317: interface.ToolCallRequestTest.ToolFunctionParametersTypeRejected ..................................... Passed 0.01 sec
Start 318: interface.ToolCallRequestTest.ToolFunctionStrictTypeRejected
318/450 Test #318: interface.ToolCallRequestTest.ToolFunctionStrictTypeRejected ......................................... Passed 0.01 sec
Start 319: interface.ToolCallRequestTest.ToolChoiceMustBeStringOrObject
319/450 Test #319: interface.ToolCallRequestTest.ToolChoiceMustBeStringOrObject ......................................... Passed 0.01 sec
Start 320: interface.ToolCallRequestTest.StringFunctionNameToolChoiceRejected
320/450 Test #320: interface.ToolCallRequestTest.StringFunctionNameToolChoiceRejected ................................... Passed 0.01 sec
Start 321: interface.ToolCallRequestTest.MalformedToolChoiceObjectsRejected
321/450 Test #321: interface.ToolCallRequestTest.MalformedToolChoiceObjectsRejected ..................................... Passed 0.01 sec
Start 322: interface.ToolCallRequestTest.UnknownToolChoiceFunctionRejected
322/450 Test #322: interface.ToolCallRequestTest.UnknownToolChoiceFunctionRejected ...................................... Passed 0.01 sec
Start 323: interface.ToolCallRequestTest.RequiredToolChoiceWithoutToolsRejected
323/450 Test #323: interface.ToolCallRequestTest.RequiredToolChoiceWithoutToolsRejected ................................. Passed 0.01 sec
Start 324: interface.ToolCallRequestTest.UnsupportedToolRequestOptionsRejected
324/450 Test #324: interface.ToolCallRequestTest.UnsupportedToolRequestOptionsRejected .................................. Passed 0.50 sec
Start 325: interface.ToolCallForwardTest.ToolChoiceDefaultsToAutoWhenOmitted
325/450 Test #325: interface.ToolCallForwardTest.ToolChoiceDefaultsToAutoWhenOmitted .................................... Passed 0.50 sec
Start 326: interface.ToolCallForwardTest.ParallelToolCallsFalseIsForwardedToNativeAndFallbackPaths
326/450 Test #326: interface.ToolCallForwardTest.ParallelToolCallsFalseIsForwardedToNativeAndFallbackPaths .............. Passed 0.50 sec
Start 327: interface.ToolCallForwardTest.StreamingToolCallWorksThroughPollInterface
327/450 Test #327: interface.ToolCallForwardTest.StreamingToolCallWorksThroughPollInterface ............................. Passed 0.50 sec
Start 328: interface.ToolCallForwardTest.NonStreamingToolCallReturnsStructuredTerminalResult
328/450 Test #328: interface.ToolCallForwardTest.NonStreamingToolCallReturnsStructuredTerminalResult .................... Passed 0.50 sec
Start 329: interface.ToolCallForwardTest.StreamingPollIgnoresToolCallInsideThinking
329/450 Test #329: interface.ToolCallForwardTest.StreamingPollIgnoresToolCallInsideThinking ............................. Passed 0.50 sec
Start 330: interface.ToolCallForwardTest.StreamingPollPreservesIdentityArgumentsAndTrailingContent
330/450 Test #330: interface.ToolCallForwardTest.StreamingPollPreservesIdentityArgumentsAndTrailingContent .............. Passed 0.50 sec
Start 331: interface.ToolCallForwardTest.StreamingPollPreservesContentWhenFirstPollIsTerminal
331/450 Test #331: interface.ToolCallForwardTest.StreamingPollPreservesContentWhenFirstPollIsTerminal ................... Passed 0.50 sec
Start 332: interface.ToolCallForwardTest.CancelDuringToolArgumentsRemovesPollTask
332/450 Test #332: interface.ToolCallForwardTest.CancelDuringToolArgumentsRemovesPollTask ............................... Passed 0.50 sec
Start 333: interface.ToolCallForwardTest.LengthTruncatedToolCallIsRejected
333/450 Test #333: interface.ToolCallForwardTest.LengthTruncatedToolCallIsRejected ...................................... Passed 0.50 sec
Start 334: interface.ToolCallForwardTest.AbortedToolCallDoesNotBecomeSuccessful
334/450 Test #334: interface.ToolCallForwardTest.AbortedToolCallDoesNotBecomeSuccessful ................................. Passed 0.50 sec
Start 335: interface.ToolCallForwardTest.DirectStreamReassemblesArgumentChunks
335/450 Test #335: interface.ToolCallForwardTest.DirectStreamReassemblesArgumentChunks .................................. Passed 0.51 sec
Start 336: interface.ToolCallForwardTest.DirectStreamCancellationDuringToolArguments
336/450 Test #336: interface.ToolCallForwardTest.DirectStreamCancellationDuringToolArguments ............................***Failed 0.50 sec
Running main() from /home/HwHiAiUser/repos/smartserve/third-party/googletest/googletest/src/gtest_main.cc
Note: Google Test filter = ToolCallForwardTest.DirectStreamCancellationDuringToolArguments
[==========] Running 1 test from 1 test suite.
[----------] Global test environment set-up.
[----------] 1 test from ToolCallForwardTest
[ RUN ] ToolCallForwardTest.DirectStreamCancellationDuringToolArguments
/home/HwHiAiUser/repos/smartserve/test/interface/toolcall_test.cpp:868: Failure
Value of: cancelled
Actual: false
Expected: true
[ FAILED ] ToolCallForwardTest.DirectStreamCancellationDuringToolArguments (494 ms)
[----------] 1 test from ToolCallForwardTest (494 ms total)
[----------] Global test environment tear-down
[==========] 1 test from 1 test suite ran. (494 ms total)
[ PASSED ] 0 tests.
[ FAILED ] 1 test, listed below:
[ FAILED ] ToolCallForwardTest.DirectStreamCancellationDuringToolArguments
1 FAILED TEST
Start 337: interface.ToolCallForwardTest.ThinkingAndToolCallsRemainSeparateAcrossPolls
337/450 Test #337: interface.ToolCallForwardTest.ThinkingAndToolCallsRemainSeparateAcrossPolls .......................... Passed 0.50 sec
Start 338: interface.ToolCallForwardTest.StreamingPollRejectsUnclosedTerminalToolCall
338/450 Test #338: interface.ToolCallForwardTest.StreamingPollRejectsUnclosedTerminalToolCall ........................... Passed 0.50 sec
Start 339: interface.ToolCallForwardTest.StreamingPollRejectsMultipleCallsWhenParallelDisabled
339/450 Test #339: interface.ToolCallForwardTest.StreamingPollRejectsMultipleCallsWhenParallelDisabled .................. Passed 0.49 sec
Start 340: interface.ToolCallForwardTest.DirectStreamRejectsMultipleCallsWhenParallelDisabled
340/450 Test #340: interface.ToolCallForwardTest.DirectStreamRejectsMultipleCallsWhenParallelDisabled ................... Passed 0.50 sec
Start 341: interface.ToolCallForwardTest.DirectStreamPreservesContentAfterToolCall
341/450 Test #341: interface.ToolCallForwardTest.DirectStreamPreservesContentAfterToolCall .............................. Passed 0.50 sec
Start 342: interface.ToolCallForwardTest.PollingDoesNotConsumeDirectStreamOutput
342/450 Test #342: interface.ToolCallForwardTest.PollingDoesNotConsumeDirectStreamOutput ................................ Passed 0.50 sec
Start 343: interface.ToolCallForwardTest.DirectStreamIgnoresToolCallInsideThinking
343/450 Test #343: interface.ToolCallForwardTest.DirectStreamIgnoresToolCallInsideThinking .............................. Passed 0.50 sec
Start 344: interface.ToolCallForwardTest.ConcurrentServeStreamsKeepTraceStateIsolated
344/450 Test #344: interface.ToolCallForwardTest.ConcurrentServeStreamsKeepTraceStateIsolated ........................... Passed 0.51 sec
Start 345: interface.ToolCallForwardTest.ToolChoiceFunctionObjectForwardsAsToolCallTask
345/450 Test #345: interface.ToolCallForwardTest.ToolChoiceFunctionObjectForwardsAsToolCallTask ......................... Passed 0.51 sec
Start 346: interface.ToolCallForwardTest.RequiredToolChoiceForwardsAsToolCallTask
346/450 Test #346: interface.ToolCallForwardTest.RequiredToolChoiceForwardsAsToolCallTask ............................... Passed 0.50 sec
Start 347: interface.ToolCallForwardTest.NoneToolChoiceDisablesToolCallTask
347/450 Test #347: interface.ToolCallForwardTest.NoneToolChoiceDisablesToolCallTask ..................................... Passed 0.49 sec
Start 348: interface.ToolCallForwardTest.EmptyToolsArrayDoesNotForwardAsToolCall
348/450 Test #348: interface.ToolCallForwardTest.EmptyToolsArrayDoesNotForwardAsToolCall ................................ Passed 0.50 sec
Start 349: interface.ToolCallForwardTest.MissingToolsDoesNotForwardAsToolCall
349/450 Test #349: interface.ToolCallForwardTest.MissingToolsDoesNotForwardAsToolCall ................................... Passed 0.49 sec
Start 350: interface.ToolCallForwardTest.ToolChoiceWithoutToolsDoesNotForwardAsToolCall
350/450 Test #350: interface.ToolCallForwardTest.ToolChoiceWithoutToolsDoesNotForwardAsToolCall ......................... Passed 0.50 sec
Start 351: api.GewuSmartServeApiTest.NullArgumentsReturnInvalidArgument
351/450 Test #351: api.GewuSmartServeApiTest.NullArgumentsReturnInvalidArgument ......................................... Passed 0.02 sec
Start 352: api.GewuSmartServeApiTest.EmptyArgumentsAreRejectedAtThePublicBoundary
352/450 Test #352: api.GewuSmartServeApiTest.EmptyArgumentsAreRejectedAtThePublicBoundary ............................... Passed 0.02 sec
Start 353: api.GewuSmartServeApiTest.ModelsDirectoryRequiresCanonicalAbsolutePath
353/450 Test #353: api.GewuSmartServeApiTest.ModelsDirectoryRequiresCanonicalAbsolutePath ............................... Passed 0.02 sec
Start 354: api.GewuSmartServeApiTest.ModelsDirectoryRejectsGroupOrWorldWritableRoot
354/450 Test #354: api.GewuSmartServeApiTest.ModelsDirectoryRejectsGroupOrWorldWritableRoot .............................***Skipped 0.02 sec
Start 355: api.GewuSmartServeApiTest.InitializeFinalizeAreIdempotent
355/450 Test #355: api.GewuSmartServeApiTest.InitializeFinalizeAreIdempotent ............................................ Passed 0.52 sec
Start 356: api.GewuSmartServeApiTest.FinalizeOwnsOuterLeaseUntilPublicEntryReturns
356/450 Test #356: api.GewuSmartServeApiTest.FinalizeOwnsOuterLeaseUntilPublicEntryReturns .............................. Passed 0.53 sec
Start 357: api.GewuSmartServeApiTest.FailedFinalizeMustBeRetriedBeforeInitialize
357/450 Test #357: api.GewuSmartServeApiTest.FailedFinalizeMustBeRetriedBeforeInitialize ................................ Passed 1.05 sec
Start 358: api.GewuSmartServeApiTest.FinalizeWaitsForActiveSdkCall
358/450 Test #358: api.GewuSmartServeApiTest.FinalizeWaitsForActiveSdkCall .............................................. Passed 0.56 sec
Start 359: api.GewuSmartServeApiTest.FinalizeIsRejectedFromSdkCallback
359/450 Test #359: api.GewuSmartServeApiTest.FinalizeIsRejectedFromSdkCallback .......................................... Passed 0.52 sec
Start 360: api.GewuSmartServeApiTest.CACertificatePathRoundTrips
360/450 Test #360: api.GewuSmartServeApiTest.CACertificatePathRoundTrips ................................................ Passed 0.02 sec
Start 361: api.GewuSmartServeApiTest.InvalidJsonIsRejectedBeforeServiceInitialization
361/450 Test #361: api.GewuSmartServeApiTest.InvalidJsonIsRejectedBeforeServiceInitialization ........................... Passed 0.02 sec
Start 362: api.GewuSmartServeApiTest.ChatCompletionsStreamInvalidJsonRejected
362/450 Test #362: api.GewuSmartServeApiTest.ChatCompletionsStreamInvalidJsonRejected ................................... Passed 0.02 sec
Start 363: api.GewuSmartServeApiTest.FreeHandlesNullAndValidPointers
363/450 Test #363: api.GewuSmartServeApiTest.FreeHandlesNullAndValidPointers ............................................ Passed 0.53 sec
Start 364: api.GewuSmartServeApiTest.VersionAndListEnginesReturnValidData
364/450 Test #364: api.GewuSmartServeApiTest.VersionAndListEnginesReturnValidData ....................................... Passed 0.52 sec
Start 365: api.GewuSmartServeApiTest.ChatCompletionsRejectsMalformedOrIncompleteRequests
365/450 Test #365: api.GewuSmartServeApiTest.ChatCompletionsRejectsMalformedOrIncompleteRequests ........................ Passed 0.53 sec
Start 366: api.GewuSmartServeApiTest.ConfigJsonValidation
366/450 Test #366: api.GewuSmartServeApiTest.ConfigJsonValidation ....................................................... Passed 0.53 sec
Start 367: api.GewuSmartServeApiTest.ConfigJsonCopiesInputBuffer
367/450 Test #367: api.GewuSmartServeApiTest.ConfigJsonCopiesInputBuffer ................................................ Passed 0.53 sec
Start 368: api.GewuSmartServeApiTest.SetModelsConfigPathLoadsConfigFile
368/450 Test #368: api.GewuSmartServeApiTest.SetModelsConfigPathLoadsConfigFile ......................................... Passed 0.53 sec
Start 369: api.GewuSmartServeApiTest.SetModelsConfigPathRejectsRelativeAndSymlinkPaths
369/450 Test #369: api.GewuSmartServeApiTest.SetModelsConfigPathRejectsRelativeAndSymlinkPaths .......................... Passed 0.02 sec
Start 370: api.GewuSmartServeApiTest.SetModelsConfigJsonRejectsSymlinkedDerivedPathsBeforeCommit
370/450 Test #370: api.GewuSmartServeApiTest.SetModelsConfigJsonRejectsSymlinkedDerivedPathsBeforeCommit ................ Passed 0.55 sec
Start 371: api.GewuSmartServeApiTest.CachedConfigJsonDoesNotReloadRelativePathFromWorkingDirectory
371/450 Test #371: api.GewuSmartServeApiTest.CachedConfigJsonDoesNotReloadRelativePathFromWorkingDirectory .............. Passed 0.54 sec
Start 372: api.GewuSmartServeApiTest.OversizedModelsConfigInputsAreRejectedWithoutReplacingCurrentConfig
372/450 Test #372: api.GewuSmartServeApiTest.OversizedModelsConfigInputsAreRejectedWithoutReplacingCurrentConfig ........ Passed 0.55 sec
Start 373: api.GewuSmartServeApiTest.SetModelsConfigPathRejectsInvalidFilesImmediately
373/450 Test #373: api.GewuSmartServeApiTest.SetModelsConfigPathRejectsInvalidFilesImmediately .......................... Passed 0.52 sec
Start 374: api.GewuSmartServeApiTest.ListModelsUsesGewuOwnerAndOpenAIShape
374/450 Test #374: api.GewuSmartServeApiTest.ListModelsUsesGewuOwnerAndOpenAIShape ...................................... Passed 0.66 sec
Start 375: api.GewuSmartServeApiTest.GetModelInfoAndDownloadInvalidModel
375/450 Test #375: api.GewuSmartServeApiTest.GetModelInfoAndDownloadInvalidModel ........................................ Passed 0.78 sec
Start 376: api.GewuSmartServeApiTest.ConcurrentListModelsAndErrorStringCallsAreThreadSafe
376/450 Test #376: api.GewuSmartServeApiTest.ConcurrentListModelsAndErrorStringCallsAreThreadSafe ....................... Passed 0.55 sec
Start 377: api.GewuSmartServeApiTest.ErrorStringCoversPublicErrorCodes
377/450 Test #377: api.GewuSmartServeApiTest.ErrorStringCoversPublicErrorCodes .......................................... Passed 0.02 sec
Start 378: api.GewuSmartServeApiTest.EightThreadsInferenceStress
378/450 Test #378: api.GewuSmartServeApiTest.EightThreadsInferenceStress ................................................ Passed 0.59 sec
Start 379: api.GewuSmartServeApiTest.RapidCancelRestartStress
379/450 Test #379: api.GewuSmartServeApiTest.RapidCancelRestartStress ................................................... Passed 0.54 sec
Start 380: api.GewuSmartServeApiTest.ConcurrentCancelOfSameRequest
380/450 Test #380: api.GewuSmartServeApiTest.ConcurrentCancelOfSameRequest .............................................. Passed 0.54 sec
Start 381: api.GewuSmartServeApiTest.ConcurrentGetModelInfo
381/450 Test #381: api.GewuSmartServeApiTest.ConcurrentGetModelInfo ..................................................... Passed 0.54 sec
Start 382: api.GewuSmartServeApiTest.ConcurrentDeleteDuringInference
382/450 Test #382: api.GewuSmartServeApiTest.ConcurrentDeleteDuringInference ............................................ Passed 0.65 sec
Start 383: api.GewuSmartServeApiTest.ConcurrentDownloadDuringInference
383/450 Test #383: api.GewuSmartServeApiTest.ConcurrentDownloadDuringInference .......................................... Passed 0.74 sec
Start 384: api.GewuSmartServeApiTest.RepeatedDownloadIsIdempotent
384/450 Test #384: api.GewuSmartServeApiTest.RepeatedDownloadIsIdempotent ............................................... Passed 0.70 sec
Start 385: api.GewuSmartServeApiTest.SmartServeEngineWrappersRegisterListAndUnregister
385/450 Test #385: api.GewuSmartServeApiTest.SmartServeEngineWrappersRegisterListAndUnregister .......................... Passed 0.53 sec
Start 386: api.GewuSmartServeApiTest.RegisterEngineCanBeUnregistered
386/450 Test #386: api.GewuSmartServeApiTest.RegisterEngineCanBeUnregistered ............................................ Passed 0.52 sec
Start 387: api.GewuSmartServeApiTest.BuiltInEngineCannotBeExternallyRegisteredOrUnregistered
387/450 Test #387: api.GewuSmartServeApiTest.BuiltInEngineCannotBeExternallyRegisteredOrUnregistered .................... Passed 0.53 sec
Start 388: api.GewuSmartServeApiTest.AppleFoundationModelCanBeRegisteredAfterInitializeAndServeChat
388/450 Test #388: api.GewuSmartServeApiTest.AppleFoundationModelCanBeRegisteredAfterInitializeAndServeChat ............. Passed 0.54 sec
Start 389: api.GewuSmartServeApiTest.SmartServeApiRegistersSystemEngineAndServesChat
389/450 Test #389: api.GewuSmartServeApiTest.SmartServeApiRegistersSystemEngineAndServesChat ............................ Passed 0.54 sec
Start 390: api.GewuSmartServeApiTest.SmartServeApisInferChatCompletionsWithoutType
390/450 Test #390: api.GewuSmartServeApiTest.SmartServeApisInferChatCompletionsWithoutType .............................. Passed 0.54 sec
Start 391: api.GewuSmartServeApiTest.AppleFoundationModelHandlesConcurrentRequests
391/450 Test #391: api.GewuSmartServeApiTest.AppleFoundationModelHandlesConcurrentRequests .............................. Passed 0.54 sec
Start 392: api.GewuSmartServeApiTest.AppleFoundationModelStreamingReturnsChunksAndEof
392/450 Test #392: api.GewuSmartServeApiTest.AppleFoundationModelStreamingReturnsChunksAndEof ........................... Passed 0.52 sec
Start 393: api.GewuSmartServeApiTest.CancelActiveRequestReturnsCancelledOnGetResponse
393/450 Test #393: api.GewuSmartServeApiTest.CancelActiveRequestReturnsCancelledOnGetResponse ........................... Passed 0.53 sec
Start 394: api.GewuSmartServeApiTest.DestroyRequestIsSafeWhileGetResponseIsRunning
394/450 Test #394: api.GewuSmartServeApiTest.DestroyRequestIsSafeWhileGetResponseIsRunning .............................. Passed 0.53 sec
Start 395: api.GewuSmartServeApiTest.FinalizeCancelsActiveRequestAndClearsOpaqueHandle
395/450 Test #395: api.GewuSmartServeApiTest.FinalizeCancelsActiveRequestAndClearsOpaqueHandle .......................... Passed 0.54 sec
Start 396: api.GewuSmartServeApiTest.CancelCompletedRequestReturnsOk
396/450 Test #396: api.GewuSmartServeApiTest.CancelCompletedRequestReturnsOk ............................................ Passed 0.54 sec
Start 397: api.GewuSmartServeApiTest.StreamingRequestCanBeCancelledAfterFirstChunk
397/450 Test #397: api.GewuSmartServeApiTest.StreamingRequestCanBeCancelledAfterFirstChunk .............................. Passed 0.53 sec
Start 398: api.GewuSmartServeApiTest.UnloadReturnsBusyAndDeleteRejectsSystemModelWhileInferenceIsActive
398/450 Test #398: api.GewuSmartServeApiTest.UnloadReturnsBusyAndDeleteRejectsSystemModelWhileInferenceIsActive ......... Passed 0.59 sec
Start 399: api.GewuSmartServeApiTest.DeleteSystemModelDoesNotRemoveSameNamedDirectory
399/450 Test #399: api.GewuSmartServeApiTest.DeleteSystemModelDoesNotRemoveSameNamedDirectory ........................... Passed 0.54 sec
Start 400: api.GewuSmartServeApiTest.InferenceRejectsConfiguredModelWithMissingDeclaredFiles
400/450 Test #400: api.GewuSmartServeApiTest.InferenceRejectsConfiguredModelWithMissingDeclaredFiles .................... Passed 0.53 sec
Start 401: api.GewuSmartServeApiTest.AppleFoundationModelLoadsFromConfigPathAfterInitializeAndRegister
401/450 Test #401: api.GewuSmartServeApiTest.AppleFoundationModelLoadsFromConfigPathAfterInitializeAndRegister .......... Passed 0.54 sec
Start 402: api.GewuSmartServeApiTest.UnregisterBusyEngineThenRetrySucceeds
402/450 Test #402: api.GewuSmartServeApiTest.UnregisterBusyEngineThenRetrySucceeds ...................................... Passed 0.55 sec
Start 403: api.GewuSmartServeApiTest.UnknownModelIdsRejectedByModelApis
403/450 Test #403: api.GewuSmartServeApiTest.UnknownModelIdsRejectedByModelApis ......................................... Passed 0.54 sec
Start 404: api.GewuSmartServeApiTest.ConfiguredModelWithUnsafeStoragePathRejected
404/450 Test #404: api.GewuSmartServeApiTest.ConfiguredModelWithUnsafeStoragePathRejected ............................... Passed 0.54 sec
Start 405: api.GewuSmartServeApiTest.FailInjectionExtractsUnusualModelId
405/450 Test #405: api.GewuSmartServeApiTest.FailInjectionExtractsUnusualModelId ........................................ Passed 0.55 sec
Start 406: api.GewuSmartServeApiTest.ChecksumVerifiedModelWithoutCurrentMetadataIsAdopted
406/450 Test #406: api.GewuSmartServeApiTest.ChecksumVerifiedModelWithoutCurrentMetadataIsAdopted ....................... Passed 0.56 sec
Start 407: api.GewuSmartServeApiTest.ModelWithoutMatchingChecksumIsNotAdopted
407/450 Test #407: api.GewuSmartServeApiTest.ModelWithoutMatchingChecksumIsNotAdopted ...................................***Skipped 0.02 sec
Start 408: api.GewuSmartServeApiTest.ModelMetadataMigratesAfterModelRootRelocation
408/450 Test #408: api.GewuSmartServeApiTest.ModelMetadataMigratesAfterModelRootRelocation ..............................***Skipped 0.02 sec
Start 409: api.GewuSmartServeApiTest.MultiFileDownloadReportsInstalledFileProgressProportionally
409/450 Test #409: api.GewuSmartServeApiTest.MultiFileDownloadReportsInstalledFileProgressProportionally ................ Passed 0.57 sec
Start 410: api.GewuSmartServeApiTest.SingleFileDownloadUsesNameInsideModelPathDirectory
410/450 Test #410: api.GewuSmartServeApiTest.SingleFileDownloadUsesNameInsideModelPathDirectory ......................... Passed 0.64 sec
Start 411: api.GewuSmartServeApiTest.DownloadAcceptsCustomHttpsAndRejectsInsecureSources
411/450 Test #411: api.GewuSmartServeApiTest.DownloadAcceptsCustomHttpsAndRejectsInsecureSources ........................ Passed 0.59 sec
Start 412: api.GewuSmartServeApiTest.SingleFileDirectoryPathIsNotReportedDownloaded
412/450 Test #412: api.GewuSmartServeApiTest.SingleFileDirectoryPathIsNotReportedDownloaded ............................. Passed 0.54 sec
Start 413: api.GewuSmartServeApiTest.MultiFileModelRequiresValidChecksumsToBeDownloaded
413/450 Test #413: api.GewuSmartServeApiTest.MultiFileModelRequiresValidChecksumsToBeDownloaded ......................... Passed 0.54 sec
Start 414: api.GewuSmartServeApiTest.DownloadRejectsPathTraversalInModelAndFilePaths
414/450 Test #414: api.GewuSmartServeApiTest.DownloadRejectsPathTraversalInModelAndFilePaths ............................ Passed 0.55 sec
Start 415: api.GewuSmartServeApiTest.ServiceLoadModelsUsesSingleFileNameInsideModelPathDirectory
415/450 Test #415: api.GewuSmartServeApiTest.ServiceLoadModelsUsesSingleFileNameInsideModelPathDirectory ................ Passed 0.55 sec
Start 416: api.GewuSmartServeApiTest.ServiceLoadModelsRejectsDirectoryForSingleFileModel
416/450 Test #416: api.GewuSmartServeApiTest.ServiceLoadModelsRejectsDirectoryForSingleFileModel ........................ Passed 0.54 sec
Start 417: api.GewuSmartServeApiTest.ServiceLoadModelsRejectsEscapedConfiguredPaths
417/450 Test #417: api.GewuSmartServeApiTest.ServiceLoadModelsRejectsEscapedConfiguredPaths ............................. Passed 0.55 sec
Start 418: api.GewuSmartServeApiTest.DownloadPersistsMetadataAndDeleteCleansIt
418/450 Test #418: api.GewuSmartServeApiTest.DownloadPersistsMetadataAndDeleteCleansIt .................................. Passed 0.59 sec
Start 419: api.GewuSmartServeApiTest.PauseDownloadCancelsAndNextDownloadResumes
419/450 Test #419: api.GewuSmartServeApiTest.PauseDownloadCancelsAndNextDownloadResumes ................................. Passed 1.39 sec
Start 420: api.GewuSmartServeApiTest.ProgressCallbackRejectsBlockingLifecycleReentryWithoutDeadlock
420/450 Test #420: api.GewuSmartServeApiTest.ProgressCallbackRejectsBlockingLifecycleReentryWithoutDeadlock ............. Passed 0.57 sec
Start 421: api.GewuSmartServeApiTest.ThreeConcurrentDownloadsOfSameModelAreIdempotent
421/450 Test #421: api.GewuSmartServeApiTest.ThreeConcurrentDownloadsOfSameModelAreIdempotent ........................... Passed 0.81 sec
Start 422: api.GewuSmartServeApiTest.DeleteDuringDownloadCancelsAndRemovesPartialModel
422/450 Test #422: api.GewuSmartServeApiTest.DeleteDuringDownloadCancelsAndRemovesPartialModel .......................... Passed 0.67 sec
Start 423: api.GewuSmartServeApiTest.DownloadStartedDuringDeleteWaitsAndRestoresModel
423/450 Test #423: api.GewuSmartServeApiTest.DownloadStartedDuringDeleteWaitsAndRestoresModel ........................... Passed 0.72 sec
Start 424: api.GewuSmartServeApiTest.InferenceStartedDuringDeleteIsRejected
424/450 Test #424: api.GewuSmartServeApiTest.InferenceStartedDuringDeleteIsRejected ..................................... Passed 0.56 sec
Start 425: api.GewuSmartServeApiTest.ConcurrentRepeatedDeleteHasDeterministicNotFoundResult
425/450 Test #425: api.GewuSmartServeApiTest.ConcurrentRepeatedDeleteHasDeterministicNotFoundResult ..................... Passed 0.67 sec
Start 426: api.GewuSmartServeApiTest.ModelQueriesDoNotWaitForActiveDownload
426/450 Test #426: api.GewuSmartServeApiTest.ModelQueriesDoNotWaitForActiveDownload ..................................... Passed 0.53 sec
Start 427: api.GewuSmartServeApiTest.ModelQueriesReturnBusyDuringDelete
427/450 Test #427: api.GewuSmartServeApiTest.ModelQueriesReturnBusyDuringDelete ......................................... Passed 0.53 sec
Start 428: api.GewuSmartServeApiTest.DeletingLargeModelDoesNotBlockUnrelatedEngineRegistration
428/450 Test #428: api.GewuSmartServeApiTest.DeletingLargeModelDoesNotBlockUnrelatedEngineRegistration .................. Passed 1.50 sec
Start 429: api.GewuSmartServeApiTest.LoadModelsSkipsModelWhileItsFilesAreBeingDeleted
429/450 Test #429: api.GewuSmartServeApiTest.LoadModelsSkipsModelWhileItsFilesAreBeingDeleted ........................... Passed 0.53 sec
Start 430: api.GewuSmartServeApiTest.DeleteUnloadsRuntimeModelWhenFilesAndMetadataAreAlreadyMissing
430/450 Test #430: api.GewuSmartServeApiTest.DeleteUnloadsRuntimeModelWhenFilesAndMetadataAreAlreadyMissing ............. Passed 0.56 sec
Start 431: api.GewuSmartServeApiTest.PreinstalledModelRequiresMatchingChecksum
431/450 Test #431: api.GewuSmartServeApiTest.PreinstalledModelRequiresMatchingChecksum .................................. Passed 0.55 sec
Start 432: api.GewuSmartServeApiTest.PreinstalledModelWithoutChecksumIsRejected
432/450 Test #432: api.GewuSmartServeApiTest.PreinstalledModelWithoutChecksumIsRejected ................................. Passed 0.53 sec
Start 433: api.GewuSmartServeApiTest.DeleteRejectsIntermediateSymlinkEscapingModelRoot
433/450 Test #433: api.GewuSmartServeApiTest.DeleteRejectsIntermediateSymlinkEscapingModelRoot .......................... Passed 0.53 sec
Start 434: functional.GewuSmartServeApiTest.FunctionalLifecycleSmoke
434/450 Test #434: functional.GewuSmartServeApiTest.FunctionalLifecycleSmoke ............................................ Passed 1.01 sec
Start 435: functional.GewuSmartServeApiTest.FunctionalEngineRegistrationSmoke
435/450 Test #435: functional.GewuSmartServeApiTest.FunctionalEngineRegistrationSmoke ................................... Passed 0.51 sec
Start 436: functional.GewuSmartServeApiTest.FunctionalModelConfigSmoke
436/450 Test #436: functional.GewuSmartServeApiTest.FunctionalModelConfigSmoke .......................................... Passed 0.58 sec
Start 437: functional.GewuSmartServeApiTest.FunctionalNonStreamingChatSmoke
437/450 Test #437: functional.GewuSmartServeApiTest.FunctionalNonStreamingChatSmoke ..................................... Passed 0.54 sec
Start 438: functional.GewuSmartServeApiTest.FunctionalStreamingChatSmoke
438/450 Test #438: functional.GewuSmartServeApiTest.FunctionalStreamingChatSmoke ........................................ Passed 0.53 sec
Start 439: functional.GewuSmartServeApiTest.FunctionalCancelRequestSmoke
439/450 Test #439: functional.GewuSmartServeApiTest.FunctionalCancelRequestSmoke ........................................ Passed 0.52 sec
Start 440: functional.GewuSmartServeApiTest.FunctionalSystemModelSmoke
440/450 Test #440: functional.GewuSmartServeApiTest.FunctionalSystemModelSmoke .......................................... Passed 0.52 sec
Start 441: functional.GewuSmartServeApiTest.FunctionalEngineSubmitFailureSmoke
441/450 Test #441: functional.GewuSmartServeApiTest.FunctionalEngineSubmitFailureSmoke .................................. Passed 0.53 sec
Start 442: functional.GewuSmartServeApiTest.FunctionalDownloadCleanupSmoke
442/450 Test #442: functional.GewuSmartServeApiTest.FunctionalDownloadCleanupSmoke ...................................... Passed 0.56 sec
Start 443: functional.GewuSmartServeApiTest.FunctionalDeleteDuringDownloadSmoke
443/450 Test #443: functional.GewuSmartServeApiTest.FunctionalDeleteDuringDownloadSmoke ................................. Passed 0.66 sec
Start 444: model_runtime.MultiSessionTest.MultiSessionAndSingleSessionMultiTask
444/450 Test #444: model_runtime.MultiSessionTest.MultiSessionAndSingleSessionMultiTask .................................***Skipped 0.52 sec
Start 445: model_runtime.MultiSessionTest.LlamaCppHonorsRequestOutputLimit
445/450 Test #445: model_runtime.MultiSessionTest.LlamaCppHonorsRequestOutputLimit ......................................***Skipped 0.52 sec
Start 446: model_runtime.MultiSessionTest.RuntimeCancelThenImmediateNewRequest
446/450 Test #446: model_runtime.MultiSessionTest.RuntimeCancelThenImmediateNewRequest ..................................***Skipped 0.52 sec
Start 447: model_runtime.SmartServeTest.SmartServeLLMInterfaceTest
447/450 Test #447: model_runtime.SmartServeTest.SmartServeLLMInterfaceTest ..............................................***Skipped 0.52 sec
Start 448: model_runtime.SmartServeTest.SmartServeLLMStreamInterfaceTest
448/450 Test #448: model_runtime.SmartServeTest.SmartServeLLMStreamInterfaceTest ........................................***Skipped 0.52 sec
Start 449: model_runtime.SmartServeTest.SmartServeMnnLoraInterfaceTest
449/450 Test #449: model_runtime.SmartServeTest.SmartServeMnnLoraInterfaceTest ..........................................***Skipped 0.52 sec
Start 450: model_runtime.SmartServeTest.SmartServeVLMInterfaceTest
450/450 Test #450: model_runtime.SmartServeTest.SmartServeVLMInterfaceTest ..............................................***Skipped 0.52 sec
99% tests passed, 1 tests failed out of 450
Total Test time (real) = 118.37 sec
The following tests did not run:
354 - api.GewuSmartServeApiTest.ModelsDirectoryRejectsGroupOrWorldWritableRoot (Skipped)
407 - api.GewuSmartServeApiTest.ModelWithoutMatchingChecksumIsNotAdopted (Skipped)
408 - api.GewuSmartServeApiTest.ModelMetadataMigratesAfterModelRootRelocation (Skipped)
444 - model_runtime.MultiSessionTest.MultiSessionAndSingleSessionMultiTask (Skipped)
445 - model_runtime.MultiSessionTest.LlamaCppHonorsRequestOutputLimit (Skipped)
446 - model_runtime.MultiSessionTest.RuntimeCancelThenImmediateNewRequest (Skipped)
447 - model_runtime.SmartServeTest.SmartServeLLMInterfaceTest (Skipped)
448 - model_runtime.SmartServeTest.SmartServeLLMStreamInterfaceTest (Skipped)
449 - model_runtime.SmartServeTest.SmartServeMnnLoraInterfaceTest (Skipped)
450 - model_runtime.SmartServeTest.SmartServeVLMInterfaceTest (Skipped)
The following tests FAILED:
336 - interface.ToolCallForwardTest.DirectStreamCancellationDuringToolArguments (Failed)
Errors while running CTest
[1;33mSome tests failed; rerunning failed tests once...[0m
Internal ctest changing into directory: /home/HwHiAiUser/repos/smartserve/build/linux
Test project /home/HwHiAiUser/repos/smartserve/build/linux
Start 336: interface.ToolCallForwardTest.DirectStreamCancellationDuringToolArguments
1/1 Test #336: interface.ToolCallForwardTest.DirectStreamCancellationDuringToolArguments ...***Failed 0.50 sec
Running main() from /home/HwHiAiUser/repos/smartserve/third-party/googletest/googletest/src/gtest_main.cc
Note: Google Test filter = ToolCallForwardTest.DirectStreamCancellationDuringToolArguments
[==========] Running 1 test from 1 test suite.
[----------] Global test environment set-up.
[----------] 1 test from ToolCallForwardTest
[ RUN ] ToolCallForwardTest.DirectStreamCancellationDuringToolArguments
/home/HwHiAiUser/repos/smartserve/test/interface/toolcall_test.cpp:868: Failure
Value of: cancelled
Actual: false
Expected: true
[ FAILED ] ToolCallForwardTest.DirectStreamCancellationDuringToolArguments (494 ms)
[----------] 1 test from ToolCallForwardTest (494 ms total)
[----------] Global test environment tear-down
[==========] 1 test from 1 test suite ran. (494 ms total)
[ PASSED ] 0 tests.
[ FAILED ] 1 test, listed below:
[ FAILED ] ToolCallForwardTest.DirectStreamCancellationDuringToolArguments
1 FAILED TEST
0% tests passed, 1 tests failed out of 1
Total Test time (real) = 0.53 sec
The following tests FAILED:
336 - interface.ToolCallForwardTest.DirectStreamCancellationDuringToolArguments (Failed)
Errors while running CTest
=== finished status=failure exit=8 duration=1912s timeout_sec=6000 attempts=2 ===